Reaction Details
TargetAlpha-1A adrenergic receptor
LigandBDBM50328483
Substrate/Competitorn/a
Meas. Tech.ChEMBL_665656 (CHEMBL1261587)
Ki 0.086±n/a nM
Citation Kristensen, JLPüschl, AJensen, MRisgaard, RChristoffersen, CTBang-Andersen, BBalle, T Exploring the neuroleptic substituent in octoclothepin: potential ligands for positron emission tomography with subnanomolar affinity fora(1)-adrenoceptors. J Med Chem53:7021-34 (2010) 
 
Alpha-1A adrenergic receptor
Name:Alpha-1A adrenergic receptor
Type:Enzyme Catalytic Domain
Mol. Mass.:51492.08
Organism:CALF
Description:adrenergic Alpha1 0 CALF
Residue:466
BDBM50328483
NameBDBM50328483
Synonyms:1-Methyl-4-(8-(1-methyl-1H-1,2,4-triazol-3-yl)-10,11-dihydrodibenzo[b,f]thiepin-10-yl)piperazine | CHEMBL1258988
TypeSmall organic molecule
Emp. Form.C22H25N5S
Mol. Mass.391.532
SMILESCN1CCN(CC1)C1Cc2ccccc2Sc2ccc(cc12)-c1ncn(C)n1