Reaction Details
TargetAlpha-1B adrenergic receptor
LigandBDBM50328476
Substrate/Competitorn/a
Meas. Tech.ChEMBL_665657 (CHEMBL1261588)
Ki 0.56±n/a nM
Citation Kristensen, JLPüschl, AJensen, MRisgaard, RChristoffersen, CTBang-Andersen, BBalle, T Exploring the neuroleptic substituent in octoclothepin: potential ligands for positron emission tomography with subnanomolar affinity fora(1)-adrenoceptors. J Med Chem53:7021-34 (2010) 
 
Alpha-1B adrenergic receptor
Name:Alpha-1B adrenergic receptor
Type:Enzyme Catalytic Domain
Mol. Mass.:56514.13
Organism:C.H.O.
Description:adrenergic Alpha1B ADRA1B C.H.O.::P18841
Residue:515
BDBM50328476
NameBDBM50328476
Synonyms:1-(2-(4-(1-(4-fluorophenyl)-5-((2-methyl-2H-tetrazol-5-yl)methyl)-1H-indol-3-yl)piperidin-1-yl)ethyl)imidazolidin-2-one | CHEMBL1259188
TypeSmall organic molecule
Emp. Form.C27H31FN8O
Mol. Mass.502.5864
SMILESCn1nnc(Cc2ccc3n(cc(C4CCN(CCN5CCNC5=O)CC4)c3c2)-c2ccc(F)cc2)n1