Reaction Details
Target5-hydroxytryptamine receptor 2C
LigandBDBM50001786
Substrate/Competitorn/a
Meas. Tech.ChEMBL_665659 (CHEMBL1261590)
Ki 0.2±n/a nM
Citation Kristensen, JLPüschl, AJensen, MRisgaard, RChristoffersen, CTBang-Andersen, BBalle, T Exploring the neuroleptic substituent in octoclothepin: potential ligands for positron emission tomography with subnanomolar affinity fora(1)-adrenoceptors. J Med Chem53:7021-34 (2010) 
 
5-hydroxytryptamine receptor 2C
Name:5-hydroxytryptamine receptor 2C
Type:G Protein-Coupled Receptor (GPCR)
Mol. Mass.:51836.79
Organism:Homo sapiens (Human)
Description:P28335
Residue:458
BDBM50001786
NameBDBM50001786
Synonyms:1-(2-{4-[5-chloro-1-(4-fluorophenyl)-1H-indol-3-yl]piperidin-1-yl}ethyl)imidazolidin-2-one CHEMBL12713 | Sertindole
TypeSmall organic molecule
Emp. Form.C24H26ClFN4O
Mol. Mass.440.941
SMILESFc1ccc(cc1)-n1cc(C2CCN(CCN3CCNC3=O)CC2)c2cc(Cl)ccc12