Reaction Details
TargetAlpha-1D adrenergic receptor
LigandBDBM50328501
Substrate/Competitorn/a
Meas. Tech.ChEMBL_665658 (CHEMBL1261589)
Ki 0.17±n/a nM
Citation Kristensen, JLPüschl, AJensen, MRisgaard, RChristoffersen, CTBang-Andersen, BBalle, T Exploring the neuroleptic substituent in octoclothepin: potential ligands for positron emission tomography with subnanomolar affinity fora(1)-adrenoceptors. J Med Chem53:7021-34 (2010) 
 
Alpha-1D adrenergic receptor
Name:Alpha-1D adrenergic receptor
Type:Protein
Mol. Mass.:59375.97
Organism:Rattus norvegicus (Rat)
Description:P23944
Residue:561
BDBM50328501
NameBDBM50328501
Synonyms:CHEMBL1259145 | rac-N-((11-(4-Methylpiperazin-1-yl)-10,11-dihydrodibenzo[b,f]thiepin-2-yl)methyl)isobutyramide
TypeSmall organic molecule
Emp. Form.C24H31N3OS
Mol. Mass.409.587
SMILESCC(C)C(=O)NCc1ccc2Sc3ccccc3CC(N3CCN(C)CC3)c2c1