Reaction Details
TargetAlpha-1D adrenergic receptor
LigandBDBM50328502
Substrate/Competitorn/a
Meas. Tech.ChEMBL_665658 (CHEMBL1261589)
Ki 0.37±n/a nM
Citation Kristensen, JLPüschl, AJensen, MRisgaard, RChristoffersen, CTBang-Andersen, BBalle, T Exploring the neuroleptic substituent in octoclothepin: potential ligands for positron emission tomography with subnanomolar affinity fora(1)-adrenoceptors. J Med Chem53:7021-34 (2010) 
 
Alpha-1D adrenergic receptor
Name:Alpha-1D adrenergic receptor
Type:Protein
Mol. Mass.:59375.97
Organism:Rattus norvegicus (Rat)
Description:P23944
Residue:561
BDBM50328502
NameBDBM50328502
Synonyms:CHEMBL1259158 | N-((11-(4-Methylpiperazin-1-yl)-10,11-dihydrodibenzo[b,f]thiepin-2-yl)methyl)pivalamide
TypeSmall organic molecule
Emp. Form.C25H33N3OS
Mol. Mass.423.614
SMILESCN1CCN(CC1)C1Cc2ccccc2Sc2ccc(CNC(=O)C(C)(C)C)cc12