Reaction Details
TargetCannabinoid receptor 1
LigandBDBM50328673
Substrate/Competitorn/a
Meas. Tech.ChEMBL_665777 (CHEMBL1259268)
Ki 1.5±n/a nM
Citation Nikas, SPAlapafuja, SOPapanastasiou, IParonis, CAShukla, VGPapahatjis, DPBowman, ALHalikhedkar, AHan, XMakriyannis, A Novel 1',1'-chain substituted hexahydrocannabinols: 9ß-hydroxy-3-(1-hexyl-cyclobut-1-yl)-hexahydrocannabinol (AM2389) a highly potent cannabinoid receptor 1 (CB1) agonist. J Med Chem53:6996-7010 (2010) 
 
Cannabinoid receptor 1
Name:Cannabinoid receptor 1
Type:G Protein-Coupled Receptor (GPCR)
Mol. Mass.:52856.55
Organism:Rattus norvegicus (rat)
Description:P20272
Residue:473
BDBM50328673
NameBDBM50328673
Synonyms:(6aR,9S,10aR)-3-[1-(5-Bromopentyl)cyclobutyl]-6a,7,8,9,10,10a-hexahydro-6,6-dimethyl-6H-dibenzo[b,d]pyran-1,9 diol | CHEMBL1259092
TypeSmall organic molecule
Emp. Form.C24H35BrO3
Mol. Mass.451.437
SMILESCC1(C)Oc2cc(cc(O)c2[C@@H]2C[C@@H](O)CC[C@@H]12)C1(CCCCCBr)CCC1