Reaction Details
TargetCannabinoid receptor 2
LigandBDBM50328668
Substrate/Competitorn/a
Meas. Tech.ChEMBL_665778 (CHEMBL1259269)
Ki 2.78±n/a nM
Citation Nikas, SPAlapafuja, SOPapanastasiou, IParonis, CAShukla, VGPapahatjis, DPBowman, ALHalikhedkar, AHan, XMakriyannis, A Novel 1',1'-chain substituted hexahydrocannabinols: 9ß-hydroxy-3-(1-hexyl-cyclobut-1-yl)-hexahydrocannabinol (AM2389) a highly potent cannabinoid receptor 1 (CB1) agonist. J Med Chem53:6996-7010 (2010) 
 
Cannabinoid receptor 2
Name:Cannabinoid receptor 2
Type:Enzyme Catalytic Domain
Mol. Mass.:38220.43
Organism:MOUSE
Description:P47936
Residue:347
BDBM50328668
NameBDBM50328668
Synonyms:(6aR,10aR)-3-[1-(4-Cyanobutyl)cyclopentyl]-6,6a,7,8,10,10ahexahydro-1-hydroxy-6,6-dimethyl-9H-dibenzo[b,d]pyran-9-one | CHEMBL1259056
TypeSmall organic molecule
Emp. Form.C25H33NO3
Mol. Mass.395.5344
SMILESCC1(C)Oc2cc(cc(O)c2[C@@H]2CC(=O)CC[C@@H]12)C1(CCCCC#N)CCCC1