Reaction Details
TargetCannabinoid receptor 2
LigandBDBM50328671
Substrate/Competitorn/a
Meas. Tech.ChEMBL_665778 (CHEMBL1259269)
Ki 4.21±n/a nM
Citation Nikas, SPAlapafuja, SOPapanastasiou, IParonis, CAShukla, VGPapahatjis, DPBowman, ALHalikhedkar, AHan, XMakriyannis, A Novel 1',1'-chain substituted hexahydrocannabinols: 9ß-hydroxy-3-(1-hexyl-cyclobut-1-yl)-hexahydrocannabinol (AM2389) a highly potent cannabinoid receptor 1 (CB1) agonist. J Med Chem53:6996-7010 (2010) 
 
Cannabinoid receptor 2
Name:Cannabinoid receptor 2
Type:Enzyme Catalytic Domain
Mol. Mass.:38220.43
Organism:MOUSE
Description:P47936
Residue:347
BDBM50328671
NameBDBM50328671
Synonyms:(6aR,9R,10aR)-3-(1-hexylcyclobutyl)-6,6-dimethyl-6a,7,8,9,10,10a-hexahydro-6H-benzo[c]chromene-1,9-diol | CHEMBL1259076
TypeSmall organic molecule
Emp. Form.C25H38O3
Mol. Mass.386.5674
SMILESCCCCCCC1(CCC1)c1cc(O)c2[C@@H]3C[C@H](O)CC[C@H]3C(C)(C)Oc2c1