Reaction Details
TargetCannabinoid receptor 2
LigandBDBM50328664
Substrate/Competitorn/a
Meas. Tech.ChEMBL_665780 (CHEMBL1259271)
Ki 11.9±n/a nM
Citation Nikas, SPAlapafuja, SOPapanastasiou, IParonis, CAShukla, VGPapahatjis, DPBowman, ALHalikhedkar, AHan, XMakriyannis, A Novel 1',1'-chain substituted hexahydrocannabinols: 9ß-hydroxy-3-(1-hexyl-cyclobut-1-yl)-hexahydrocannabinol (AM2389) a highly potent cannabinoid receptor 1 (CB1) agonist. J Med Chem53:6996-7010 (2010) 
 
Cannabinoid receptor 2
Name:Cannabinoid receptor 2
Type:G Protein-Coupled Receptor (GPCR)
Mol. Mass.:39690.94
Organism:Homo sapiens (Human)
Description:P34972
Residue:360
BDBM50328664
NameBDBM50328664
Synonyms:(6aR,10aR)-3-(1-Hexyl-cyclobut-1-yl)-6,6a,7,8,10,10a-hexahydro-1-hydroxy-6,6-dimethyl-9H-dibenzo[b,d]pyran-9-one | CHEMBL1259018
TypeSmall organic molecule
Emp. Form.C25H36O3
Mol. Mass.384.5515
SMILESCCCCCCC1(CCC1)c1cc(O)c2[C@@H]3CC(=O)CC[C@H]3C(C)(C)Oc2c1