Reaction Details
TargetCannabinoid receptor 2
LigandBDBM50328669
Substrate/Competitorn/a
Meas. Tech.ChEMBL_665780 (CHEMBL1259271)
Ki 5.88±n/a nM
Citation Nikas, SPAlapafuja, SOPapanastasiou, IParonis, CAShukla, VGPapahatjis, DPBowman, ALHalikhedkar, AHan, XMakriyannis, A Novel 1',1'-chain substituted hexahydrocannabinols: 9ß-hydroxy-3-(1-hexyl-cyclobut-1-yl)-hexahydrocannabinol (AM2389) a highly potent cannabinoid receptor 1 (CB1) agonist. J Med Chem53:6996-7010 (2010) 
 
Cannabinoid receptor 2
Name:Cannabinoid receptor 2
Type:G Protein-Coupled Receptor (GPCR)
Mol. Mass.:39690.94
Organism:Homo sapiens (Human)
Description:P34972
Residue:360
BDBM50328669
NameBDBM50328669
Synonyms:(6aR,10aR)-3-[1-(5-Bromopentyl)cyclobutyl]-6,6a,7,8,10,10ahexahydro-1-hydroxy-6,6-dimethyl-9H-dibenzo[b,d]pyran-9-one | CHEMBL1259057
TypeSmall organic molecule
Emp. Form.C24H33BrO3
Mol. Mass.449.421
SMILESCC1(C)Oc2cc(cc(O)c2[C@@H]2CC(=O)CC[C@@H]12)C1(CCCCCBr)CCC1