Reaction Details
TargetProtein arginine N-methyltransferase 1 [11-371]
LigandBDBM50210461
Substrate/Competitorn/a
Meas. Tech.ChEMBL_675528 (CHEMBL1273741)
Ki 35000±n/a nM
Citation Feng, YLi, MWang, BZheng, YG Discovery and mechanistic study of a class of protein arginine methylation inhibitors. J Med Chem53:6028-39 (2010) 
 
Protein arginine N-methyltransferase 1 [11-371]
Name:Protein arginine N-methyltransferase 1 [11-371]
Type:Protein
Mol. Mass.:41506.52
Organism:Homo sapiens (Human)
Description:Q99873[11-371]
Residue:361
BDBM50210461
NameBDBM50210461
Synonyms:(stilbamidine)4-[2-[4-amino(imino)methylphenyl]-(E)-1-ethenyl]phenyl-iminomethanamine 4-((E)-2-{4-[(Z)-amino(imino)methyl]phenyl}vinyl)benzenecarboximidamide CHEMBL142304 stilbamidine
TypeSmall organic molecule
Emp. Form.C16H16N4
Mol. Mass.264.325
SMILESNC(=N)c1ccc(\C=C\c2ccc(cc2)C(N)=N)cc1