Reaction Details
TargetProtein arginine N-methyltransferase 1 [11-371]
LigandBDBM50328744
Substrate/Competitorn/a
Meas. Tech.ChEMBL_675347 (CHEMBL1273384)
IC50 50500±n/a nM
Citation Feng, YLi, MWang, BZheng, YG Discovery and mechanistic study of a class of protein arginine methylation inhibitors. J Med Chem53:6028-39 (2010) 
 
Protein arginine N-methyltransferase 1 [11-371]
Name:Protein arginine N-methyltransferase 1 [11-371]
Type:Protein
Mol. Mass.:41506.52
Organism:Homo sapiens (Human)
Description:Q99873[11-371]
Residue:361
BDBM50328744
NameBDBM50328744
Synonyms:7-hydroxy-8-((2-methoxy-5-(vinylsulfonyl)phenyl)diazenyl)naphthalene-1,3-disulfonate | CHEMBL1271164
TypeSmall organic molecule
Emp. Form.C19H16N2O10S3
Mol. Mass.528.533
SMILESCOc1ccc(cc1N=Nc1c(O)ccc2cc(cc(c12)S(O)(=O)=O)S(O)(=O)=O)S(=O)(=O)C=C