Reaction Details
TargetProtein arginine N-methyltransferase 1 [11-371]
LigandBDBM50328747
Substrate/Competitorn/a
Meas. Tech.ChEMBL_675347 (CHEMBL1273384)
IC50 1029000±n/a nM
Citation Feng, YLi, MWang, BZheng, YG Discovery and mechanistic study of a class of protein arginine methylation inhibitors. J Med Chem53:6028-39 (2010) 
 
Protein arginine N-methyltransferase 1 [11-371]
Name:Protein arginine N-methyltransferase 1 [11-371]
Type:Protein
Mol. Mass.:41506.52
Organism:Homo sapiens (Human)
Description:Q99873[11-371]
Residue:361
BDBM50328747
NameBDBM50328747
Synonyms:3-(phenylsulfonyloxy)naphthalene-1-sulfonate | CHEMBL1270653
TypeSmall organic molecule
Emp. Form.C16H12O6S2
Mol. Mass.364.393
SMILESOS(=O)(=O)c1cc(OS(=O)(=O)c2ccccc2)cc2ccccc12