Reaction Details
TargetProtein arginine N-methyltransferase 1 [11-371]
LigandBDBM50328748
Substrate/Competitorn/a
Meas. Tech.ChEMBL_675347 (CHEMBL1273384)
IC50 1063000±n/a nM
Citation Feng, YLi, MWang, BZheng, YG Discovery and mechanistic study of a class of protein arginine methylation inhibitors. J Med Chem53:6028-39 (2010) 
 
Protein arginine N-methyltransferase 1 [11-371]
Name:Protein arginine N-methyltransferase 1 [11-371]
Type:Protein
Mol. Mass.:41506.52
Organism:Homo sapiens (Human)
Description:Q99873[11-371]
Residue:361
BDBM50328748
NameBDBM50328748
Synonyms:4-((2-carboxyphenyl)diazenyl)-3-hydroxynaphthalene-2,7-disulfonate | CHEMBL1270654
TypeSmall organic molecule
Emp. Form.C17H12N2O9S2
Mol. Mass.452.415
SMILESOC(=O)c1ccccc1N=Nc1c(O)c(cc2cc(ccc12)S(O)(=O)=O)S(O)(=O)=O