Reaction Details
TargetProtein arginine N-methyltransferase 1 [11-371]
LigandBDBM50328745
Substrate/Competitorn/a
Meas. Tech.ChEMBL_675342 (CHEMBL1273379)
IC50 72100±n/a nM
Citation Feng, YLi, MWang, BZheng, YG Discovery and mechanistic study of a class of protein arginine methylation inhibitors. J Med Chem53:6028-39 (2010) 
 
Protein arginine N-methyltransferase 1 [11-371]
Name:Protein arginine N-methyltransferase 1 [11-371]
Type:Protein
Mol. Mass.:41506.52
Organism:Homo sapiens (Human)
Description:Q99873[11-371]
Residue:361
BDBM50328745
NameBDBM50328745
Synonyms:4,5-dihydroxy-3-((8-hydroxy-3,6-disulfonatonaphthalen-1-yl)diazenyl)naphthalene-2,7-disulfonate CHEMBL409290
TypeSmall organic molecule
Emp. Form.C20H14N2O15S4
Mol. Mass.650.59
SMILESOc1cc(cc2cc(c(N=Nc3cc(cc4cc(cc(O)c34)S(O)(=O)=O)S(O)(=O)=O)c(O)c12)S(O)(=O)=O)S(O)(=O)=O