Reaction Details
TargetProtein arginine N-methyltransferase 6
LigandBDBM50328743
Substrate/Competitorn/a
Meas. Tech.ChEMBL_675523 (CHEMBL1273736)
IC50 39200±n/a nM
Citation Feng, YLi, MWang, BZheng, YG Discovery and mechanistic study of a class of protein arginine methylation inhibitors. J Med Chem53:6028-39 (2010) 
 
Protein arginine N-methyltransferase 6
Name:Protein arginine N-methyltransferase 6
Type:Protein
Mol. Mass.:41928.48
Organism:Homo sapiens (Human)
Description:n/a
Residue:375
BDBM50328743
NameBDBM50328743
Synonyms:3-((4-acetamidophenyl)diazenyl)-4-hydroxy-7-(3-(5-hydroxy-6-((E)-phenyldiazenyl)-7-sulfonaphthalen-2-yl)ureido)naphthalene-2-sulfonate CHEMBL1092740 | NSC-47762
TypeSmall organic molecule
Emp. Form.C35H27N7O10S2
Mol. Mass.769.76
SMILESCC(=O)Nc1ccc(cc1)N=Nc1c(O)c2ccc(NC(=O)Nc3ccc4c(O)c(N=Nc5ccccc5)c(cc4c3)S(O)(=O)=O)cc2cc1S(O)(=O)=O