Reaction Details
TargetHistamine H3 receptor
LigandBDBM50328802
Substrate/Competitorn/a
Meas. Tech.ChEMBL_673776 (CHEMBL1274953)
IC50 119±n/a nM
Citation Anderson, JTCampbell, MWang, JBrunden, KRHarrington, JJStricker-Krongrad, ASong, JDoucette, CMurphy, SBennani, YL Investigation of 4-piperidinols as novel H3 antagonists. Bioorg Med Chem Lett20:6246-9 (2010) 
 
Histamine H3 receptor
Name:Histamine H3 receptor
Type:PROTEIN
Mol. Mass.:48560.37
Organism:Mus musculus
Description:ChEMBL_988451
Residue:445
BDBM50328802
NameBDBM50328802
Synonyms:(2R,4S,5S)-1,2,5-trimethyl-4-(naphthalen-1-ylethynyl)piperidin-4-ol | CHEMBL1269844
TypeSmall organic molecule
Emp. Form.C20H23NO
Mol. Mass.293.4027
SMILESC[C@@H]1C[C@@](O)(C#Cc2cccc3ccccc23)[C@@H](C)CN1C