Reaction Details
TargetHistamine H3 receptor
LigandBDBM50328813
Substrate/Competitorn/a
Meas. Tech.ChEMBL_673776 (CHEMBL1274953)
IC50 9730±n/a nM
Citation Anderson, JTCampbell, MWang, JBrunden, KRHarrington, JJStricker-Krongrad, ASong, JDoucette, CMurphy, SBennani, YL Investigation of 4-piperidinols as novel H3 antagonists. Bioorg Med Chem Lett20:6246-9 (2010) 
 
Histamine H3 receptor
Name:Histamine H3 receptor
Type:PROTEIN
Mol. Mass.:48560.37
Organism:Mus musculus
Description:ChEMBL_988451
Residue:445
BDBM50328813
NameBDBM50328813
Synonyms:CHEMBL1270265 | rac-1,2,5-trimethyl-4-(quinolin-8-ylethynyl)piperidin-4-ol
TypeSmall organic molecule
Emp. Form.C19H22N2O
Mol. Mass.294.3908
SMILESCC1CC(O)(C#Cc2cccc3cccnc23)C(C)CN1C