Reaction Details
TargetHistamine H3 receptor
LigandBDBM50328810
Substrate/Competitorn/a
Meas. Tech.ChEMBL_673777 (CHEMBL1274954)
IC50 5±n/a nM
Citation Anderson, JTCampbell, MWang, JBrunden, KRHarrington, JJStricker-Krongrad, ASong, JDoucette, CMurphy, SBennani, YL Investigation of 4-piperidinols as novel H3 antagonists. Bioorg Med Chem Lett20:6246-9 (2010) 
 
Histamine H3 receptor
Name:Histamine H3 receptor
Type:G Protein-Coupled Receptor (GPCR)
Mol. Mass.:48691.47
Organism:Homo sapiens (Human)
Description:Binding assays were using CHO cells stably expressing hH3R receptors.
Residue:445
BDBM50328810
NameBDBM50328810
Synonyms:CHEMBL1270166 | rac-6-methyl-7-(naphthalen-1-ylethynyl)octahydroindolizin-7-ol
TypeSmall organic molecule
Emp. Form.C21H23NO
Mol. Mass.305.4134
SMILESCC1CN2CCCC2CC1(O)C#Cc1cccc2ccccc12