Reaction Details
TargetCarbonic anhydrase 1
LigandBDBM24514
Substrate/Competitorn/a
Meas. Tech.ChEMBL_673811 (CHEMBL1274988)
IC50 330±n/a nM
Citation Innocenti, ASupuran, CT Paraoxon, 4-nitrophenyl phosphate and acetate are substrates ofa- but not ofß-,¿- and¿-carbonic anhydrases. Bioorg Med Chem Lett20:6208-12 (2010) 
 
Carbonic anhydrase 1
Name:Carbonic anhydrase 1
Type:Enzyme
Mol. Mass.:28873.37
Organism:Homo sapiens (Human)
Description:P00915
Residue:261
BDBM24514
NameBDBM24514
Synonyms:4-nitrophenoxyphosphonic acid CHEMBL24231 | p-nitrophenyl phosphate
TypeSmall organic molecule
Emp. Form.C6H6NO6P
Mol. Mass.219.0887
SMILESOP(O)(=O)Oc1ccc(cc1)[N+]([O-])=O