Reaction Details
TargetCarbonic anhydrase 2
LigandBDBM50240416
Substrate/Competitorn/a
Meas. Tech.ChEMBL_673814 (CHEMBL1274991)
IC50 59±n/a nM
Citation Innocenti, ASupuran, CT Paraoxon, 4-nitrophenyl phosphate and acetate are substrates ofa- but not ofß-,¿- and¿-carbonic anhydrases. Bioorg Med Chem Lett20:6208-12 (2010) 
 
Carbonic anhydrase 2
Name:Carbonic anhydrase 2
Type:Enzyme
Mol. Mass.:29250.71
Organism:Homo sapiens (Human)
Description:P00918
Residue:260
BDBM50240416
NameBDBM50240416
Synonyms:CHEMBL23838 diethyl 4-nitrophenyl phosphate diethyl paraoxon p-nitrophenyl diethyl phosphate phosphacol | phosphoric acid diethyl 4-nitrophenyl ester
TypeSmall organic molecule
Emp. Form.C10H14NO6P
Mol. Mass.275.195
SMILESCCOP(=O)(OCC)Oc1ccc(cc1)[N+]([O-])=O