Reaction Details
TargetCarbonic anhydrase 13
LigandBDBM50240416
Substrate/Competitorn/a
Meas. Tech.ChEMBL_673817 (CHEMBL1274994)
IC50 1021±n/a nM
Citation Innocenti, ASupuran, CT Paraoxon, 4-nitrophenyl phosphate and acetate are substrates ofa- but not ofß-,¿- and¿-carbonic anhydrases. Bioorg Med Chem Lett20:6208-12 (2010) 
 
Carbonic anhydrase 13
Name:Carbonic anhydrase 13
Type:Enzyme
Mol. Mass.:29522.80
Organism:Mus musculus (mouse)
Description:Murine cloned isozyme
Residue:262
BDBM50240416
NameBDBM50240416
Synonyms:CHEMBL23838 diethyl 4-nitrophenyl phosphate diethyl paraoxon p-nitrophenyl diethyl phosphate phosphacol | phosphoric acid diethyl 4-nitrophenyl ester
TypeSmall organic molecule
Emp. Form.C10H14NO6P
Mol. Mass.275.195
SMILESCCOP(=O)(OCC)Oc1ccc(cc1)[N+]([O-])=O