Reaction Details
TargetSubstance-P receptor
LigandBDBM50328979
Substrate/Competitorn/a
Meas. Tech.ChEMBL_674023 (CHEMBL1275200)
Ki 0.28±n/a nM
Citation Xiao, DWang, CPalani, ATsui, HCReichard, GPaliwal, SShih, NYAslanian, RDuffy, RLachowicz, JVarty, GMorgan, CLiu, FNomeir, A Discovery of a series of potent, orally activea,a-disubstituted piperidine NK(1) antagonists. Bioorg Med Chem Lett20:6313-5 (2010) 
 
Substance-P receptor
Name:Substance-P receptor
Type:G Protein-Coupled Receptor (GPCR)
Mol. Mass.:46254.43
Organism:Homo sapiens (Human)
Description:P25103
Residue:407
BDBM50328979
NameBDBM50328979
Synonyms:CHEMBL1270465 | N-((3S,6S)-6-(((R)-1-(3,5-bis(trifluoromethyl)phenyl)ethoxy)methyl)-6-phenylpiperidin-3-yl)-4,5-dihydrooxazol-2-amine
TypeSmall organic molecule
Emp. Form.C25H27F6N3O2
Mol. Mass.515.4912
SMILESC[C@@H](OC[C@]1(CC[C@@H](CN1)N=C1NCCO1)c1ccccc1)c1cc(cc(c1)C(F)(F)F)C(F)(F)F