Reaction Details
TargetSubstance-P receptor
LigandBDBM50328983
Substrate/Competitorn/a
Meas. Tech.ChEMBL_674023 (CHEMBL1275200)
Ki 0.56±n/a nM
Citation Xiao, DWang, CPalani, ATsui, HCReichard, GPaliwal, SShih, NYAslanian, RDuffy, RLachowicz, JVarty, GMorgan, CLiu, FNomeir, A Discovery of a series of potent, orally activea,a-disubstituted piperidine NK(1) antagonists. Bioorg Med Chem Lett20:6313-5 (2010) 
 
Substance-P receptor
Name:Substance-P receptor
Type:G Protein-Coupled Receptor (GPCR)
Mol. Mass.:46254.43
Organism:Homo sapiens (Human)
Description:P25103
Residue:407
BDBM50328983
NameBDBM50328983
Synonyms:(3R,6S)-6-(((R)-1-(3,5-bis(trifluoromethyl)phenyl)ethoxy)methyl)-N-methyl-6-phenylpiperidine-3-carboxamide | CHEMBL1270665
TypeSmall organic molecule
Emp. Form.C24H26F6N2O2
Mol. Mass.488.4659
SMILESCNC(=O)[C@@H]1CC[C@](CO[C@H](C)c2cc(cc(c2)C(F)(F)F)C(F)(F)F)(NC1)c1ccccc1