Reaction Details
Target1,4-dihydroxy-2-naphthoyl-CoA synthase
LigandBDBM50329089
Substrate/Competitorn/a
Meas. Tech.ChEMBL_674193 (CHEMBL1274290)
IC50 30000±n/a nM
Citation Li, XLiu, NZhang, HKnudson, SESlayden, RATonge, PJ Synthesis and SAR studies of 1,4-benzoxazine MenB inhibitors: novel antibacterial agents against Mycobacterium tuberculosis. Bioorg Med Chem Lett20:6306-9 (2010) 
 
1,4-dihydroxy-2-naphthoyl-CoA synthase
Name:1,4-dihydroxy-2-naphthoyl-CoA synthase
Type:PROTEIN
Mol. Mass.:34688.06
Organism:Mycobacterium tuberculosis
Description:ChEMBL_817596
Residue:314
BDBM50329089
NameBDBM50329089
Synonyms:(Z)-methyl 2-(7-fluoro-2-oxo-2H-benzo[b][1,4]oxazin-3(4H)-ylidene)acetate | CHEMBL1269430
TypeSmall organic molecule
Emp. Form.C11H8FNO4
Mol. Mass.237.1839
SMILESCOC(=O)Cc1nc2ccc(F)cc2oc1=O