Reaction Details
Target1,4-dihydroxy-2-naphthoyl-CoA synthase
LigandBDBM50329092
Substrate/Competitorn/a
Meas. Tech.ChEMBL_674193 (CHEMBL1274290)
IC50>122000±n/a nM
Citation Li, XLiu, NZhang, HKnudson, SESlayden, RATonge, PJ Synthesis and SAR studies of 1,4-benzoxazine MenB inhibitors: novel antibacterial agents against Mycobacterium tuberculosis. Bioorg Med Chem Lett20:6306-9 (2010) 
 
1,4-dihydroxy-2-naphthoyl-CoA synthase
Name:1,4-dihydroxy-2-naphthoyl-CoA synthase
Type:PROTEIN
Mol. Mass.:34688.06
Organism:Mycobacterium tuberculosis
Description:ChEMBL_817596
Residue:314
BDBM50329092
NameBDBM50329092
Synonyms:(Z)-methyl 2-(3-oxo-3,4-dihydroquinoxalin-2(1H)-ylidene)acetate | CHEMBL1269433
TypeSmall organic molecule
Emp. Form.C11H10N2O3
Mol. Mass.218.2087
SMILESCOC(=O)Cc1nc2ccccc2[nH]c1=O