Reaction Details
TargetDelta-type opioid receptor
LigandBDBM50329097
Substrate/Competitorn/a
Meas. Tech.ChEMBL_674208 (CHEMBL1274305)
Ki 0.57±n/a nM
Citation Nagase, HNemoto, TMatsubara, ASaito, MYamamoto, NOsa, YHirayama, SNakajima, MNakao, KMochizuki, HFujii, H Design and synthesis of KNT-127, ad-opioid receptor agonist effective by systemic administration. Bioorg Med Chem Lett20:6302-5 (2010) 
 
Delta-type opioid receptor
Name:Delta-type opioid receptor
Type:Enzyme Catalytic Domain
Mol. Mass.:40577.25
Organism:MOUSE
Description:P32300
Residue:372
BDBM50329097
NameBDBM50329097
Synonyms:CHEMBL1270185
TypeSmall organic molecule
Emp. Form.C31H30N2O2
Mol. Mass.462.5821
SMILESOc1ccc2C[C@H]3N(CCc4ccccc4)CC[C@@]4(Cc5nc6ccccc6cc5C[C@@]34O)c2c1