Reaction Details
TargetCalcitonin gene-related peptide type 1 receptor
LigandBDBM50329175
Substrate/Competitorn/a
Meas. Tech.ChEMBL_674593 (CHEMBL1273692)
Ki 0.11±n/a nM
Citation Wood, MRSchirripa, KMKim, JJBednar, RAFay, JFBruno, JGMoore, ELMosser, SDRoller, SSalvatore, CAVacca, JPSelnick, HG Novel CGRP receptor antagonists from central amide replacements causing a reversal of preferred chirality. Bioorg Med Chem Lett20:6827-30 (2010) 
 
Calcitonin gene-related peptide type 1 receptor
Name:Calcitonin gene-related peptide type 1 receptor
Type:Enzyme Catalytic Domain
Mol. Mass.:52980.45
Organism:Homo sapiens (Human)
Description:Q16602
Residue:461
BDBM50329175
NameBDBM50329175
Synonyms:CHEMBL1269645 | N-(((R)-2,3-dihydro-1H-inden-1-yl)methyl)-N-(((S)-2'-oxo-1,1',2',3-tetrahydrospiro[cyclopenta[b]quinoline-2,3'-pyrrolo[2,3-b]pyridine]-7-yl)methyl)pivalamide
TypeSmall organic molecule
Emp. Form.C34H34N4O2
Mol. Mass.530.6594
SMILESCC(C)(C)C(=O)N(C[C@@H]1CCc2ccccc12)Cc1ccc2nc3C[C@]4(Cc3cc2c1)C(=O)Nc1ncccc41