Reaction Details
TargetCalcitonin gene-related peptide type 1 receptor
LigandBDBM50329177
Substrate/Competitorn/a
Meas. Tech.ChEMBL_674593 (CHEMBL1273692)
Ki 0.3±n/a nM
Citation Wood, MRSchirripa, KMKim, JJBednar, RAFay, JFBruno, JGMoore, ELMosser, SDRoller, SSalvatore, CAVacca, JPSelnick, HG Novel CGRP receptor antagonists from central amide replacements causing a reversal of preferred chirality. Bioorg Med Chem Lett20:6827-30 (2010) 
 
Calcitonin gene-related peptide type 1 receptor
Name:Calcitonin gene-related peptide type 1 receptor
Type:Enzyme Catalytic Domain
Mol. Mass.:52980.45
Organism:Homo sapiens (Human)
Description:Q16602
Residue:461
BDBM50329177
NameBDBM50329177
Synonyms:(S)-3-(((S)-6-(3,5-difluorophenyl)-3,3-dimethyl-2-oxopiperidin-1-yl)methyl)-6,8-dihydrospiro[cyclopenta[g]quinoline-7,3'-pyrrolo[2,3-b]pyridin]-2'(1'H)-one | CHEMBL1270484
TypeSmall organic molecule
Emp. Form.C32H28F2N4O2
Mol. Mass.538.5871
SMILESCC1(C)CC[C@H](N(Cc2cnc3cc4C[C@]5(Cc4cc3c2)C(=O)Nc2ncccc52)C1=O)c1cc(F)cc(F)c1