Reaction Details
TargetPolyunsaturated fatty acid lipoxygenase ALOX15
LigandBDBM50026078
Substrate/Competitorn/a
Meas. Tech.ChEMBL_675412 (CHEMBL1273492)
Ki<10±n/a nM
Citation Rai, GKenyon, VJadhav, ASchultz, LArmstrong, MJameson, JBHoobler, ELeister, WSimeonov, AHolman, TRMaloney, DJ Discovery of potent and selective inhibitors of human reticulocyte 15-lipoxygenase-1. J Med Chem53:7392-404 (2010) 
 
Polyunsaturated fatty acid lipoxygenase ALOX15
Name:Polyunsaturated fatty acid lipoxygenase ALOX15
Type:Protein
Mol. Mass.:74804.05
Organism:Homo sapiens (Human)
Description:n/a
Residue:662
BDBM50026078
NameBDBM50026078
Synonyms:CHEMBL1271219
TypeSmall organic molecule
Emp. Form.C23H14F2N2O3S
Mol. Mass.436.431
SMILESFc1ccc(C(=O)OCC#CCSc2nnc(o2)-c2cccc3ccccc23)c(F)c1