Reaction Details
TargetPolyunsaturated fatty acid lipoxygenase ALOX15
LigandBDBM50417160
Substrate/Competitorn/a
Meas. Tech.ChEMBL_675422 (CHEMBL1273502)
Ki 81±n/a nM
Citation Rai, GKenyon, VJadhav, ASchultz, LArmstrong, MJameson, JBHoobler, ELeister, WSimeonov, AHolman, TRMaloney, DJ Discovery of potent and selective inhibitors of human reticulocyte 15-lipoxygenase-1. J Med Chem53:7392-404 (2010) 
 
Polyunsaturated fatty acid lipoxygenase ALOX15
Name:Polyunsaturated fatty acid lipoxygenase ALOX15
Type:Protein
Mol. Mass.:74804.05
Organism:Homo sapiens (Human)
Description:n/a
Residue:662
BDBM50417160
NameBDBM50417160
Synonyms:CHEMBL1270811
TypeSmall organic molecule
Emp. Form.C20H15FN2O4S
Mol. Mass.398.408
SMILESCOc1ccccc1-c1nnc(SCC#CCOC(=O)c2ccc(F)cc2)o1