Reaction Details
TargetMyosin light chain kinase, smooth muscle
LigandBDBM50329500
Substrate/Competitorn/a
Meas. Tech.ChEMBL_674288 (CHEMBL1274488)
IC50 51000±n/a nM
Citation Asano, SKomiya, MKoike, NKoga, ENakatani, SIsobe, Y 5,6,7,8-Tetrahydropyrido[4,3-d]pyrimidines as novel class of potent and highly selective CaMKII inhibitors. Bioorg Med Chem Lett20:6696-8 (2010) 
 
Myosin light chain kinase, smooth muscle
Name:Myosin light chain kinase, smooth muscle
Type:Protein
Mol. Mass.:210702.56
Organism:Homo sapiens (Human)
Description:Q15746
Residue:1914
BDBM50329500
NameBDBM50329500
Synonyms:4-chloro-N-(2-(phenethylamino)pyrimidin-4-yl)benzenesulfonamide | CHEMBL1270522
TypeSmall organic molecule
Emp. Form.C18H17ClN4O2S
Mol. Mass.388.871
SMILESClc1ccc(cc1)S(=O)(=O)Nc1ccnc(NCCc2ccccc2)n1