Reaction Details
TargetGlutamate receptor ionotropic, NMDA 2B
LigandBDBM50143890
Substrate/Competitorn/a
Meas. Tech.ChEMBL_674454 (CHEMBL1274598)
Ki 3.09±n/a nM
Citation Fuchigami, TYamaguchi, HOgawa, MBiao, LNakayama, MHaratake, MMagata, Y Synthesis and biological evaluation of radio-iodinated benzimidazoles as SPECT imaging agents for NR2B subtype of NMDA receptor. Bioorg Med Chem18:7497-506 (2010) 
 
Glutamate receptor ionotropic, NMDA 2B
Name:Glutamate receptor ionotropic, NMDA 2B
Type:Protein
Mol. Mass.:166077.66
Organism:Rattus norvegicus (Rat)
Description:Q00960
Residue:1482
BDBM50143890
NameBDBM50143890
Synonyms:2-(4-Benzyl-piperidin-1-ylmethyl)-3H-benzoimidazol-5-ol | CHEMBL65231
TypeSmall organic molecule
Emp. Form.C20H23N3O
Mol. Mass.321.4161
SMILESOc1ccc2nc(CN3CCC(Cc4ccccc4)CC3)[nH]c2c1