Reaction Details
TargetCarbonic anhydrase 9
LigandBDBM50329604
Substrate/Competitorn/a
Meas. Tech.ChEMBL_674959 (CHEMBL1272636)
Ki 126±n/a nM
Citation Gluszok, SFrédérick, RFoulon, CKlupsch, FSupuran, CTVullo, DScozzafava, AGoossens, JFMasereel, BDepreux, PGoossens, L Design, solid-phase synthesis, and biological evaluation of novel 1,5-diarylpyrrole-3-carboxamides as carbonic anhydrase IX inhibitors. Bioorg Med Chem18:7392-401 (2010) 
 
Carbonic anhydrase 9
Name:Carbonic anhydrase 9
Type:Enzyme
Mol. Mass.:49669.03
Organism:Homo sapiens (Human)
Description:Catalytic domain of human cloned isozyme was used in the assay
Residue:459
BDBM50329604
NameBDBM50329604
Synonyms:CHEMBL1270632 | N-[2-(4-Methylpiperazino)ethyl]-1-[4-(aminosulfonyl)-phenyl]-2-methyl-5-(2-naphthyl)-1H-pyrrole-3-carboxamide
TypeSmall organic molecule
Emp. Form.C29H33N5O3S
Mol. Mass.531.669
SMILESCN1CCN(CCNC(=O)c2cc(-c3ccc4ccccc4c3)n(c2C)-c2ccc(cc2)S(N)(=O)=O)CC1