Reaction Details
TargetCarbonic anhydrase 1
LigandBDBM50329763
Substrate/Competitorn/a
Meas. Tech.ChEMBL_674740 (CHEMBL1273993)
Kd 1000±n/a nM
Citation Sudžius, JBaranauskiene, LGolovenko, DMatuliene, JMichailoviene, VTorresan, JJachno, JSukackaite, RManakova, EGražulis, STumkevičius, SMatulis, D 4-[N-(substituted 4-pyrimidinyl)amino]benzenesulfonamides as inhibitors of carbonic anhydrase isozymes I, II, VII, and XIII. Bioorg Med Chem18:7413-21 (2010) 
 
Carbonic anhydrase 1
Name:Carbonic anhydrase 1
Type:Enzyme
Mol. Mass.:28873.37
Organism:Homo sapiens (Human)
Description:P00915
Residue:261
BDBM50329763
NameBDBM50329763
Synonyms:4-[N-(6-Chloro-5-formyl-2-methylthiopyrimidin-4-yl)amino]benzenesulfonamide CHEMBL1233721
TypeSmall organic molecule
Emp. Form.C12H11ClN4O3S2
Mol. Mass.358.824
SMILESCSc1nc(Cl)c(C=O)c(Nc2ccc(cc2)S(N)(=O)=O)n1