Reaction Details
TargetCarbonic anhydrase 2
LigandBDBM50329768
Substrate/Competitorn/a
Meas. Tech.ChEMBL_674742 (CHEMBL1273995)
Kd 16±n/a nM
Citation Sudžius, JBaranauskiene, LGolovenko, DMatuliene, JMichailoviene, VTorresan, JJachno, JSukackaite, RManakova, EGražulis, STumkevičius, SMatulis, D 4-[N-(substituted 4-pyrimidinyl)amino]benzenesulfonamides as inhibitors of carbonic anhydrase isozymes I, II, VII, and XIII. Bioorg Med Chem18:7413-21 (2010) 
 
Carbonic anhydrase 2
Name:Carbonic anhydrase 2
Type:Enzyme
Mol. Mass.:29250.71
Organism:Homo sapiens (Human)
Description:P00918
Residue:260
BDBM50329768
NameBDBM50329768
Synonyms:4-{2-[N-(6-Benzylamino-5-nitropyrimidin-4-yl)amino]ethyl}benzenesulfonamide | CHEMBL1271572
TypeSmall organic molecule
Emp. Form.C19H20N6O4S
Mol. Mass.428.465
SMILESNS(=O)(=O)c1ccc(CCNc2ncnc(NCc3ccccc3)c2[N+]([O-])=O)cc1