Reaction Details
TargetCarbonic anhydrase 2
LigandBDBM50329760
Substrate/Competitorn/a
Meas. Tech.ChEMBL_674743 (CHEMBL1273996)
Kd 220±n/a nM
Citation Sudžius, JBaranauskiene, LGolovenko, DMatuliene, JMichailoviene, VTorresan, JJachno, JSukackaite, RManakova, EGražulis, STumkevičius, SMatulis, D 4-[N-(substituted 4-pyrimidinyl)amino]benzenesulfonamides as inhibitors of carbonic anhydrase isozymes I, II, VII, and XIII. Bioorg Med Chem18:7413-21 (2010) 
 
Carbonic anhydrase 2
Name:Carbonic anhydrase 2
Type:Enzyme
Mol. Mass.:29250.71
Organism:Homo sapiens (Human)
Description:P00918
Residue:260
BDBM50329760
NameBDBM50329760
Synonyms:4-[N-(6-Chloro-5-cyano-2-methylthiopyrimidin-4-yl)amino]benzenesulfonamide | CHEMBL1272233
TypeSmall organic molecule
Emp. Form.C12H10ClN5O2S2
Mol. Mass.355.823
SMILESCSc1nc(Cl)c(C#N)c(Nc2ccc(cc2)S(N)(=O)=O)n1