Reaction Details
TargetCarbonic anhydrase 1
LigandBDBM50329826
Substrate/Competitorn/a
Meas. Tech.ChEMBL_675712 (CHEMBL1272346)
Kd 4500±n/a nM
Citation Capkauskaite, EBaranauskiene, LGolovenko, DManakova, EGražulis, STumkevičius, SMatulis, D Indapamide-like benzenesulfonamides as inhibitors of carbonic anhydrases I, II, VII, and XIII. Bioorg Med Chem18:7357-64 (2010) 
 
Carbonic anhydrase 1
Name:Carbonic anhydrase 1
Type:Enzyme
Mol. Mass.:28873.37
Organism:Homo sapiens (Human)
Description:P00915
Residue:261
BDBM50329826
NameBDBM50329826
Synonyms:2-Chloro-5-[(2-isopropyl-1H-benzimidazol-1-yl)acetyl]benzenesulfonamide N-alkylated benzimidazole derivative, 4h
TypeSmall organic molecule
Emp. Form.C18H18ClN3O3S
Mol. Mass.391.872
SMILESCC(C)c1nc2ccccc2n1CC(=O)c1ccc(Cl)c(c1)S(N)(=O)=O