Reaction Details
TargetCarbonic anhydrase 7
LigandBDBM50329826
Substrate/Competitorn/a
Meas. Tech.ChEMBL_675714 (CHEMBL1272348)
Kd 2000±n/a nM
Citation Capkauskaite, EBaranauskiene, LGolovenko, DManakova, EGražulis, STumkevičius, SMatulis, D Indapamide-like benzenesulfonamides as inhibitors of carbonic anhydrases I, II, VII, and XIII. Bioorg Med Chem18:7357-64 (2010) 
 
Carbonic anhydrase 7
Name:Carbonic anhydrase 7
Type:Enzyme
Mol. Mass.:29664.11
Organism:Homo sapiens (Human)
Description:Human cloned isozyme.
Residue:264
BDBM50329826
NameBDBM50329826
Synonyms:2-Chloro-5-[(2-isopropyl-1H-benzimidazol-1-yl)acetyl]benzenesulfonamide N-alkylated benzimidazole derivative, 4h
TypeSmall organic molecule
Emp. Form.C18H18ClN3O3S
Mol. Mass.391.872
SMILESCC(C)c1nc2ccccc2n1CC(=O)c1ccc(Cl)c(c1)S(N)(=O)=O