Reaction Details
TargetTyrosine-protein kinase Lck
LigandBDBM50262685
Substrate/Competitorn/a
Meas. Tech.ChEMBL_675750 (CHEMBL1272384)
IC50 16±n/a nM
Citation Machrouhi, FOuhamou, NLaderoute, KCalaoagan, JBukhtiyarova, MEhrlich, PJKlon, AE The rational design of a novel potent analogue of the 5'-AMP-activated protein kinase inhibitor compound C with improved selectivity and cellular activity. Bioorg Med Chem Lett20:6394-9 (2010) 
 
Tyrosine-protein kinase Lck
Name:Tyrosine-protein kinase Lck
Type:n/a
Mol. Mass.:57987.83
Organism:Homo sapiens (Human)
Description:P06239
Residue:509
BDBM50262685
NameBDBM50262685
Synonyms:6-(4-(2-(piperidin-1-yl)ethoxy)phenyl)-3-(pyridin-4-yl)pyrazolo[1,5-a]pyrimidine CHEMBL478629 US9040694, Dorsomorphin
TypeSmall organic molecule
Emp. Form.C24H25N5O
Mol. Mass.399.4882
SMILESC(CN1CCCCC1)Oc1ccc(cc1)-c1cnc2c(cnn2c1)-c1ccncc1