Reaction Details
TargetOrexin/Hypocretin receptor type 1
LigandBDBM50417257
Substrate/Competitorn/a
Meas. Tech.ChEMBL_676045 (CHEMBL1273039)
Ki 0.316±n/a nM
Citation Micheli, FAntolini, MDi Fabio, RPellacani, APozzan, A 2-Methyl-3-furanyl-4H-1,2,4-triazol-3-ylthioamides: a new class of selective orexin 2 antagonists. Bioorg Med Chem Lett20:6405-7 (2010) 
 
Orexin/Hypocretin receptor type 1
Name:Orexin/Hypocretin receptor type 1
Type:Protein
Mol. Mass.:47554.50
Organism:Homo sapiens (Human)
Description:O43613
Residue:425
BDBM50417257
NameBDBM50417257
Synonyms:SB-649868
TypeSmall organic molecule
Emp. Form.C26H24FN3O3S
Mol. Mass.477.55
SMILESCc1nc(C(=O)N2CCCC[C@H]2CNC(=O)c2cccc3occc23)c(s1)-c1ccc(F)cc1