Reaction Details
TargetVIM-13
LigandBDBM50092158
Substrate/Competitorn/a
Meas. Tech.ChEMBL_678225 (CHEMBL1280220)
IC50 69300±n/a nM
Citation Juan, CBeceiro, AGutiérrez, OAlbertí, SGarau, MPérez, JLBou, GOliver, A Characterization of the new metallo-beta-lactamase VIM-13 and its integron-borne gene from a Pseudomonas aeruginosa clinical isolate in Spain. Antimicrob Agents Chemother52:3589-96 (2008) 
 
VIM-13
Name:VIM-13
Type:PROTEIN
Mol. Mass.:28208.69
Organism:Pseudomonas aeruginosa
Description:ChEMBL_678225
Residue:266
BDBM50092158
NameBDBM50092158
Synonyms:1,10-phenanthroline US10669227, Compound 1,10-phenanthroline US9187406, 1,10-phenanthroline | cid_1318
TypeSmall organic molecule
Emp. Form.C12H8N2
Mol. Mass.180.2053
SMILESc1cnc2c(c1)ccc1cccnc21