Reaction Details
TargetCarbonic anhydrase 1
LigandBDBM50330330
Substrate/Competitorn/a
Meas. Tech.ChEMBL_685535 (CHEMBL1285702)
IC50 6100±n/a nM
Citation Kasimogullari, RBülbül, MArslan, BSGökçe, B Synthesis, characterization and antiglaucoma activity of some novel pyrazole derivatives of 5-amino-1,3,4-thiadiazole-2-sulfonamide. Eur J Med Chem45:4769-73 (2010) 
 
Carbonic anhydrase 1
Name:Carbonic anhydrase 1
Type:Enzyme
Mol. Mass.:28873.37
Organism:Homo sapiens (Human)
Description:P00915
Residue:261
BDBM50330330
NameBDBM50330330
Synonyms:CHEMBL1276020 | Ethyl1-(3-(2-(1-ethoxy-1,3-dioxo-3-phenylpropan-2-ylidene)hydrazinyl)phenyl)-5-phenyl-3-(5-sulfamoyl-1,3,4-thiadiazol-2-ylcarbamoyl)-1H-pyrazole-4-carboxylate
TypeSmall organic molecule
Emp. Form.C32H28N8O8S2
Mol. Mass.716.744
SMILESCCOC(=O)C(=NNc1cccc(c1)-n1nc(C(=O)Nc2nnc(s2)S(N)(=O)=O)c(C(=O)OCC)c1-c1ccccc1)C(=O)c1ccccc1