Reaction Details
TargetCarbonic anhydrase 1
LigandBDBM50330332
Substrate/Competitorn/a
Meas. Tech.ChEMBL_685537 (CHEMBL1285704)
Ki 270±n/a nM
Citation Kasimogullari, RBülbül, MArslan, BSGökçe, B Synthesis, characterization and antiglaucoma activity of some novel pyrazole derivatives of 5-amino-1,3,4-thiadiazole-2-sulfonamide. Eur J Med Chem45:4769-73 (2010) 
 
Carbonic anhydrase 1
Name:Carbonic anhydrase 1
Type:Enzyme
Mol. Mass.:28873.37
Organism:Homo sapiens (Human)
Description:P00915
Residue:261
BDBM50330332
NameBDBM50330332
Synonyms:CHEMBL1276022 | Diethyl 2-(2-(3-(4-(ethoxycarbonyl)-5-phenyl-3-(5-sulfamoyl-1,3,4-thiadiazol-2-ylcarbamoyl)-1H-pyrazol-1-yl)phenyl)hydrazono)malonate
TypeSmall organic molecule
Emp. Form.C28H28N8O9S2
Mol. Mass.684.7
SMILES[#6]-[#6]-[#8]-[#6](=O)-[#6](=[#7]\[#7]-c1cccc(c1)-n1nc(-[#6](=O)-[#7]-c2nnc(s2)S([#7])(=O)=O)c(-[#6](=O)-[#8]-[#6]-[#6])c1-c1ccccc1)\[#6](=O)-[#8]-[#6]-[#6]