Reaction Details
TargetCarbonic anhydrase 1
LigandBDBM50330334
Substrate/Competitorn/a
Meas. Tech.ChEMBL_685539 (CHEMBL1285706)
IC50 70±n/a nM
Citation Kasimogullari, RBülbül, MArslan, BSGökçe, B Synthesis, characterization and antiglaucoma activity of some novel pyrazole derivatives of 5-amino-1,3,4-thiadiazole-2-sulfonamide. Eur J Med Chem45:4769-73 (2010) 
 
Carbonic anhydrase 1
Name:Carbonic anhydrase 1
Type:Enzyme
Mol. Mass.:28873.37
Organism:Homo sapiens (Human)
Description:P00915
Residue:261
BDBM50330334
NameBDBM50330334
Synonyms:CHEMBL1276024 | Ethyl1-(2-methyl-1-(2-oxopropyl)-1H-indol-4-yl)-5-phenyl-3-(5-sulfamoyl-1,3,4-thiadiazol-2-ylcarbamoyl)-1Hpyrazole-4-carboxylate
TypeSmall organic molecule
Emp. Form.C27H25N7O6S2
Mol. Mass.607.661
SMILESCCOC(=O)c1c(nn(c1-c1ccccc1)-c1cccc2n(CC(C)=O)c(C)cc12)C(=O)Nc1nnc(s1)S(N)(=O)=O