Reaction Details
TargetCarbonic anhydrase 2
LigandBDBM50330339
Substrate/Competitorn/a
Meas. Tech.ChEMBL_685534 (CHEMBL1285701)
IC50 580±n/a nM
Citation Kasimogullari, RBülbül, MArslan, BSGökçe, B Synthesis, characterization and antiglaucoma activity of some novel pyrazole derivatives of 5-amino-1,3,4-thiadiazole-2-sulfonamide. Eur J Med Chem45:4769-73 (2010) 
 
Carbonic anhydrase 2
Name:Carbonic anhydrase 2
Type:Enzyme
Mol. Mass.:29250.71
Organism:Homo sapiens (Human)
Description:P00918
Residue:260
BDBM50330339
NameBDBM50330339
Synonyms:CHEMBL1276018 | Ethyl1-(3-(2-(1,3-dioxo-1-phenylbutan-2-ylidene)hydrazinyl)phenyl)-5-phenyl-3-(5-sulfamoyl-1,3,4-thiadiazol-2-ylcarbamoyl)-1H-pyrazole-4-carboxylate
TypeSmall organic molecule
Emp. Form.C31H26N8O7S2
Mol. Mass.686.718
SMILESCCOC(=O)c1c(nn(c1-c1ccccc1)-c1cccc(NN=C(C(C)=O)C(=O)c2ccccc2)c1)C(=O)Nc1nnc(s1)S(N)(=O)=O