Reaction Details
TargetPurine nucleoside phosphorylase
LigandBDBM50330397
Substrate/Competitorn/a
Meas. Tech.ChEMBL_684503 (CHEMBL1287512)
IC50 524000±n/a nM
Citation Cui, HRuda, GFCarrero-Lérida, JRuiz-Pérez, LMGilbert, IHGonzález-Pacanowska, D Exploring new inhibitors of Plasmodium falciparum purine nucleoside phosphorylase. Eur J Med Chem45:5140-9 (2010) 
 
Purine nucleoside phosphorylase
Name:Purine nucleoside phosphorylase
Type:Enzyme
Mol. Mass.:26857.85
Organism:Plasmodium falciparum
Description:n/a
Residue:245
BDBM50330397
NameBDBM50330397
Synonyms:1-((4-Pyrrolidine-1-yl)-butyl)uracil | CHEMBL1275702
TypeSmall organic molecule
Emp. Form.C12H19N3O2
Mol. Mass.237.2982
SMILESO=c1ccn(CCCCN2CCCC2)c(=O)[nH]1