Reaction Details
TargetFructose-bisphosphate aldolase A
LigandBDBM50330434
Substrate/Competitorn/a
Meas. Tech.ChEMBL_684839 (CHEMBL1286069)
Ki 850000±n/a nM
Citation Daher, RCoinçon, MFonvielle, MGest, PMGuerin, MEJackson, MSygusch, JTherisod, M Rational design, synthesis, and evaluation of new selective inhibitors of microbial class II (zinc dependent) fructose bis-phosphate aldolases. J Med Chem53:7836-42 (2010) 
 
Fructose-bisphosphate aldolase A
Name:Fructose-bisphosphate aldolase A
Type:PROTEIN
Mol. Mass.:39351.00
Organism:Oryctolagus cuniculus
Description:ChEMBL_813854
Residue:364
BDBM50330434
NameBDBM50330434
Synonyms:4-(N-hydroxy-2-(phosphonooxy)acetamido)butyl hexanoate | CHEMBL1278086
TypeSmall organic molecule
Emp. Form.C12H24NO8P
Mol. Mass.341.2946
SMILESCCCCCC(=O)OCCCCN(O)C(=O)COP(O)(O)=O