Reaction Details
TargetFructose-bisphosphate aldolase A
LigandBDBM50330437
Substrate/Competitorn/a
Meas. Tech.ChEMBL_684839 (CHEMBL1286069)
Ki 15000±n/a nM
Citation Daher, RCoinçon, MFonvielle, MGest, PMGuerin, MEJackson, MSygusch, JTherisod, M Rational design, synthesis, and evaluation of new selective inhibitors of microbial class II (zinc dependent) fructose bis-phosphate aldolases. J Med Chem53:7836-42 (2010) 
 
Fructose-bisphosphate aldolase A
Name:Fructose-bisphosphate aldolase A
Type:PROTEIN
Mol. Mass.:39351.00
Organism:Oryctolagus cuniculus
Description:ChEMBL_813854
Residue:364
BDBM50330437
NameBDBM50330437
Synonyms:1,6-di-O-phosphono-D-fructose CHEMBL1235112
TypeSmall organic molecule
Emp. Form.C6H14O12P2
Mol. Mass.340.1157
SMILESOC(COP(O)(O)=O)[C@@H](O)C(=O)[C@H](O)COP(O)(O)=O