Reaction Details
TargetTransient receptor potential cation channel subfamily V member 1
LigandBDBM50330680
Substrate/Competitorn/a
Meas. Tech.ChEMBL_685077 (CHEMBL1286693)
Ki 9.43±n/a nM
Citation Kang, DWKim, YSLim, KSKim, MSPearce, LVPavlyukovets, VATao, AKLang-Kuhs, KABlumberg, PMLee, J Halogenation of 4-hydroxy/amino-3-methoxyphenyl acetamide TRPV1 agonists showed enhanced antagonism to capsaicin. Bioorg Med Chem18:8092-105 (2010) 
 
Transient receptor potential cation channel subfamily V member 1
Name:Transient receptor potential cation channel subfamily V member 1
Type:Transient Receptor
Mol. Mass.:94956.12
Organism:Rattus norvegicus (rat)
Description:O35433
Residue:838
BDBM50330680
NameBDBM50330680
Synonyms:2-(4-tert-Butylbenzyl)-3-[2-(4-amino-3,5-dichlorophenyl)acetamido]propyl pivalate | CHEMBL1277211
TypeSmall organic molecule
Emp. Form.C27H36Cl2N2O3
Mol. Mass.507.492
SMILESCC(C)(C)C(=O)OCC(CNC(=O)Cc1cc(Cl)c(N)c(Cl)c1)Cc1ccc(cc1)C(C)(C)C